Target
D(3) dopamine receptor
Ligand
BDBM50048232
Substrate
Meas. Tech.
ChEMBL_61949 (CHEMBL671349)
Ki
420±n/a nM
Citation
 Thurkauf, AYuan, JChen, XWasley, JWMeade, RWoodruff, KHHuston, KRoss, PC 1-Phenyl-3-(aminomethyl)pyrroles as potential antipsychotic agents. Synthesis and dopamine receptor binding. J Med Chem 38:4950-2 (1996)  
Target
Name:
D(3) dopamine receptor
Synonyms:
DRD3 | DRD3_CHLAE
Type:
PROTEIN
Mol. Mass.:
44355.59
Organism:
Chlorocebus aethiops
Description:
ChEMBL_105569
Residue:
400
  
Inhibitor
Name:
BDBM50048232
Synonyms:
1-(1-Phenyl-1H-pyrrol-3-ylmethyl)-4-(3-trifluoromethyl-phenyl)-piperidin-4-ol | CHEMBL446892
Type:
Small organic molecule
Emp. Form.:
C23H23F3N2O
Mol. Mass.:
400.4367
SMILES:
OC1(CCN(Cc2ccn(c2)-c2ccccc2)CC1)c1cccc(c1)C(F)(F)F
: