Target
D(2) dopamine receptor
Ligand
BDBM50048239
Substrate
Meas. Tech.
ChEMBL_59154 (CHEMBL671035)
Ki
36±n/a nM
Citation
 Thurkauf, AYuan, JChen, XWasley, JWMeade, RWoodruff, KHHuston, KRoss, PC 1-Phenyl-3-(aminomethyl)pyrroles as potential antipsychotic agents. Synthesis and dopamine receptor binding. J Med Chem 38:4950-2 (1996)  
Target
Name:
D(2) dopamine receptor
Synonyms:
DRD2 Dopamine D2 receptor
Type:
PROTEIN
Mol. Mass.:
50619.11
Organism:
Cercopithecus aethiops
Description:
ChEMBL_59156
Residue:
443
  
Inhibitor
Name:
BDBM50048239
Synonyms:
1-Phenyl-8-(1-phenyl-1H-pyrrol-3-ylmethyl)-1,3,8-triaza-spiro[4.5]decan-4-one | CHEMBL356542
Type:
Small organic molecule
Emp. Form.:
C24H26N4O
Mol. Mass.:
386.4894
SMILES:
O=C1NCN(c2ccccc2)C11CCN(Cc2ccn(c2)-c2ccccc2)CC1
: