Target
Delta-type opioid receptor
Ligand
BDBM50036140
Substrate
Meas. Tech.
ChEMBL_147294 (CHEMBL756033)
Ki
0.013000±n/a nM
Citation
 Portoghese, PSFarouz-Grant, FSultana, MTakemori, AE 7'-Substituted amino acid conjugates of naltrindole. Hydrophilic groups as determinants of selective antagonism of delta 1 opioid receptor-mediated antinociception in mice. J Med Chem 38:402-7 (1995)  
Target
Name:
Delta-type opioid receptor
Synonyms:
D-OR-1 Delta opioid receptor OPIATE Delta OPRD1 OPRK1 | opioid receptor, delta 1
Type:
G Protein-Coupled Receptor (GPCR)
Mol. Mass.:
40382.98
Organism:
Homo sapiens (Human)
Description:
Competition binding assays were carried out using membrane preparations from transfected HN9.10 cells that constitutively expressed the delta opioid receptor.
Residue:
372
  
Inhibitor
Name:
BDBM50036140
Synonyms:
22-cyclopropylmethyl-2,16-dihydroxy-(2S,13R)-14-oxa-11,22-diazaheptacyclo[13.9.1.01,13.02,21.04,12.05,10.019,25]pentacosa-4(12),5(10),6,8,15(25),16,18-heptaene-9-carboxylic acid | CHEMBL132420
Type:
Small organic molecule
Emp. Form.:
C27H26N2O5
Mol. Mass.:
458.5057
SMILES:
OC(=O)c1cccc2c3C[C@@]4(O)C5Cc6ccc(O)c7O[C@@H](c3[nH]c12)C4(CCN5CC1CC1)c67
: