Target
Thyroid hormone receptor beta
Ligand
BDBM18865
Substrate
Meas. Tech.
ChEMBL_143915 (CHEMBL752718)
IC50
0.110000±n/a nM
Citation
 Yokoyama, NWalker, GNMain, AJStanton, JLMorrissey, MMBoehm, CEngle, ANeubert, ADWasvary, JMStephan, ZF Synthesis and structure-activity relationships of oxamic acid and acetic acid derivatives related to L-thyronine. J Med Chem 38:695-707 (1995)  
Target
Name:
Thyroid hormone receptor beta
Synonyms:
Erba2 THB_RAT Thyroid Hormone Receptor (TR-beta) Thyroid hormone receptor beta-1 | thyroid beta
Type:
Enzyme Catalytic Domain
Mol. Mass.:
52661.52
Organism:
RAT
Description:
thyroid beta 0 RAT::P18113
Residue:
461
  
Inhibitor
Name:
BDBM18865
Synonyms:
3-{3,5-dibromo-4-[4-hydroxy-3-(propan-2-yl)phenoxy]phenyl}propanoic acid dibromo phenylpropionic acid, 6
Type:
Small organic molecule
Emp. Form.:
C18H18Br2O4
Mol. Mass.:
458.141
SMILES:
CC(C)c1cc(Oc2c(Br)cc(CCC(O)=O)cc2Br)ccc1O
: