Target
Thyroid hormone receptor beta
Ligand
BDBM50036426
Substrate
Meas. Tech.
ChEMBL_143914 (CHEMBL872845)
IC50
2.5±n/a nM
Citation
 Yokoyama, NWalker, GNMain, AJStanton, JLMorrissey, MMBoehm, CEngle, ANeubert, ADWasvary, JMStephan, ZF Synthesis and structure-activity relationships of oxamic acid and acetic acid derivatives related to L-thyronine. J Med Chem 38:695-707 (1995)  
Target
Name:
Thyroid hormone receptor beta
Synonyms:
Erba2 THB_RAT Thyroid Hormone Receptor (TR-beta) Thyroid hormone receptor beta-1 | thyroid beta
Type:
Enzyme Catalytic Domain
Mol. Mass.:
52661.52
Organism:
RAT
Description:
thyroid beta 0 RAT::P18113
Residue:
461
  
Inhibitor
Name:
BDBM50036426
Synonyms:
CHEMBL159610 | N-{4-[3-(4-Fluoro-benzoyl)-4-hydroxy-phenoxy]-3,5-dimethyl-phenyl}-oxalamic acid
Type:
Small organic molecule
Emp. Form.:
C23H18FNO6
Mol. Mass.:
423.3905
SMILES:
Cc1cc(NC(=O)C(O)=O)cc(C)c1Oc1ccc(O)c(c1)C(=O)c1ccc(F)cc1
: