Target
Adenosine receptor A2a
Ligand
BDBM50135288
Substrate
Meas. Tech.
ChEMBL_30921 (CHEMBL647731)
Ki
692±n/a nM
Citation
 Siddiqi, SMJacobson, KAEsker, JLOlah, MEJi, XDMelman, NTiwari, KNSecrist, JASchneller, SWCristalli, G Search for new purine- and ribose-modified adenosine analogues as selective agonists and antagonists at adenosine receptors. J Med Chem 38:1174-88 (1995)  
Target
Name:
Adenosine receptor A2a
Synonyms:
AA2AR_RAT Adenosine A2 receptor Adenosine Receptors A2a (A2a) Adenosine receptors A2a Rat striatal adenosine A2a receptor
Type:
G Protein-Coupled Receptor (GPCR)
Mol. Mass.:
45015.65
Organism:
Rattus norvegicus (rat)
Description:
Rat A2A receptors expressed in CHO cells.
Residue:
410
  
Inhibitor
Name:
BDBM50135288
Synonyms:
(1S,2R,3S,4R)-4-(6-Amino-purin-9-yl)-cyclopentane-1,2,3-triol CHEMBL129014 | NORARISTEROMYCIN
Type:
Small organic molecule
Emp. Form.:
C10H13N5O3
Mol. Mass.:
251.2419
SMILES:
Nc1ncnc2n(cnc12)[C@@H]1C[C@H](O)[C@@H](O)[C@H]1O
: