Target
Adenosine receptor A1
Ligand
BDBM50454085
Substrate
Meas. Tech.
ChEMBL_29014 (CHEMBL875796)
Ki
42±n/a nM
Citation
 Siddiqi, SMJacobson, KAEsker, JLOlah, MEJi, XDMelman, NTiwari, KNSecrist, JASchneller, SWCristalli, G Search for new purine- and ribose-modified adenosine analogues as selective agonists and antagonists at adenosine receptors. J Med Chem 38:1174-88 (1995)  
Target
Name:
Adenosine receptor A1
Synonyms:
AA1R_RAT ADENOSINE A1 high Adenosine A1 receptor (A1) Adenosine receptors A1 | Adora1
Type:
Protein
Mol. Mass.:
36704.13
Organism:
Rattus norvegicus (rat)
Description:
Residue:
326
  
Inhibitor
Name:
BDBM50454085
Synonyms:
CHEMBL2113474
Type:
Small organic molecule
Emp. Form.:
C18H19N5O6
Mol. Mass.:
401.3734
SMILES:
OC[C@H]1O[C@H]([C@H](O)[C@@H]1O)n1cnc2c(NC3COc4ccccc4O3)ncnc12
: