Target
Adenosine receptor A3
Ligand
BDBM50080390
Substrate
Meas. Tech.
ChEMBL_30466 (CHEMBL643127)
Ki
360±n/a nM
Citation
 Siddiqi, SMJacobson, KAEsker, JLOlah, MEJi, XDMelman, NTiwari, KNSecrist, JASchneller, SWCristalli, G Search for new purine- and ribose-modified adenosine analogues as selective agonists and antagonists at adenosine receptors. J Med Chem 38:1174-88 (1995)  
Target
Name:
Adenosine receptor A3
Synonyms:
AA3R_RAT Adenosine receptor A2a and A3 | Adora3
Type:
PROTEIN
Mol. Mass.:
36643.73
Organism:
Rattus norvegicus
Description:
ChEMBL_479910
Residue:
320
  
Inhibitor
Name:
BDBM50080390
Synonyms:
(2R,3R,4S,5R)-2-(6-(2-methyl-benzylamino)-9H-purin-9-yl)-5-(hydroxymethyl)-tetrahydrofuran-3,4-diol Adenosine analog, 16 Metrifudil
Type:
Small organic molecule
Emp. Form.:
C18H21N5O4
Mol. Mass.:
371.3904
SMILES:
Cc1ccccc1CNc1ncnc2n(cnc12)[C@@H]1O[C@H](CO)[C@@H](O)[C@H]1O
: