Target
Platelet-activating factor receptor
Ligand
BDBM50034220
Substrate
Meas. Tech.
ChEMBL_162891 (CHEMBL768221)
Temperature
310.15±n/a K
IC50
>200000±n/a nM
Comments
extracted
Citation
 Fos, ESuesa, NBorras, LLobato, CBanfi, PGambetta, RAZunino, FMauleón, DCarganico, G Synthesis of alkyl chain-modified ether lipids and evaluation of their in vitro cytotoxicity. J Med Chem 38:1216-28 (1995)  
Target
Name:
Platelet-activating factor receptor
Synonyms:
PAF-R PTAFR_CAVPO Platelet-activating factor receptor
Type:
Protein
Mol. Mass.:
39005.63
Organism:
Cavia porcellus
Description:
Residue:
342
  
Inhibitor
Name:
BDBM50034220
Synonyms:
2-(((Hexadecyloxy)hydroxyphosphinyl)oxy)-N,N,N-trimethylethanaminium hydroxide MILTEFOSINE hexadecyl 2-(trimethyl-lambda~5~-azanyl)ethyl hydrogen phosphate hexadecyloxy-2-trimethylammonioethylphosphorate hexadecylphosphocholine, miltefosine | n-hexadecylphosphocholine
Type:
Small organic molecule
Emp. Form.:
C21H46NO4P
Mol. Mass.:
407.568
SMILES:
CCCCCCCCCCCCCCCCOP([O-])(=O)OCC[N+](C)(C)C
: