Target
D(2) dopamine receptor
Ligand
BDBM50034365
Substrate
Meas. Tech.
ChEMBL_61304 (CHEMBL673096)
Ki
50±n/a nM
Citation
 Sonesson, CBarf, TNilsson, JDijkstra, DCarlsson, ASvensson, KSmith, MWMartin, IJDuncan, JNKing, LJ Synthesis and evaluation of pharmacological and pharmacokinetic properties of monopropyl analogs of 5-, 7-, and 8-[[(trifluoromethyl)sulfonyl]oxy]-2-aminotetralins: central dopamine and serotonin receptor activity. J Med Chem 38:1319-29 (1995)  
Target
Name:
D(2) dopamine receptor
Synonyms:
D(2) dopamine receptor DOPAMINE D2 Long DRD2 Dopamine D2 receptor Dopamine D2 receptor (D2R) Dopamine2-like | d2
Type:
Cell-surface receptors
Mol. Mass.:
50647.10
Organism:
Homo sapiens (Human)
Description:
P14416
Residue:
443
  
Inhibitor
Name:
BDBM50034365
Synonyms:
CHEMBL554220 | Trifluoro-methanesulfonic acid (R)-7-propylamino-5,6,7,8-tetrahydro-naphthalen-2-yl ester; hydrochloride
Type:
Small organic molecule
Emp. Form.:
C14H18F3NO3S
Mol. Mass.:
337.358
SMILES:
CCCN[C@@H]1CCc2ccc(OS(=O)(=O)C(F)(F)F)cc2C1
: