Target
Dipeptidyl peptidase 2
Ligand
BDBM50050525
Substrate
Meas. Tech.
ChEMBL_53370 (CHEMBL884359)
IC50
60±n/a nM
Citation
 Coutts, SJKelly, TASnow, RJKennedy, CABarton, RWAdams, JKrolikowski, DAFreeman, DMCampbell, SJKsiazek, JFBachovchin, WW Structure-activity relationships of boronic acid inhibitors of dipeptidyl peptidase IV. 1. Variation of the P2 position of Xaa-boroPro dipeptides. J Med Chem 39:2087-94 (1996)  
Target
Name:
Dipeptidyl peptidase 2
Synonyms:
DAP II DPP2_HUMAN Dipeptidyl aminopeptidase II Dipeptidyl peptidase 2 (DPP2) Dipeptidyl peptidase II (DPP II) Dipeptidyl peptidase II and dipeptidyl peptidase IV (DPP2 and DPP4) carboxytripeptidase dipeptidyl(amino)peptidase II | dipeptidylarylamidase
Type:
Protein
Mol. Mass.:
54339.29
Organism:
Homo sapiens (Human)
Description:
Q9UHL4
Residue:
492
  
Inhibitor
Name:
BDBM50050525
Synonyms:
(R)-1-((S)-2-aminopropanoyl)pyrrolidin-2-ylboronic acid CHEMBL63860 US11559537, Compound 1129 US8933056, Asp-boroPro
Type:
Small organic molecule
Emp. Form.:
C7H15BN2O3
Mol. Mass.:
186.017
SMILES:
C[C@H](N)C(=O)N1CCC[C@H]1B(O)O
: