Target
Leukotriene B4 receptor 1
Ligand
BDBM50052027
Substrate
Meas. Tech.
ChEMBL_99833 (CHEMBL709862)
Ki
0.80±n/a nM
Citation
 Brooks, CDSummers, JB Modulators of leukotriene biosynthesis and receptor activation. J Med Chem 39:2629-54 (1996)  
Target
Name:
Leukotriene B4 receptor 1
Synonyms:
BLT BLTR Chemoattractant receptor-like 1 GPR16 LTB4-R 1 Leukotriene B4 R1 Leukotriene B4 receptor 1 P2Y purinoceptor 7 | P2Y7
Type:
Enzyme Catalytic Domain
Mol. Mass.:
37582.68
Organism:
Homo sapiens (Human)
Description:
Q15722
Residue:
352
  
Inhibitor
Name:
BDBM50052027
Synonyms:
(E)-3-[6-(2,6-Dichloro-phenylsulfanylmethyl)-3-phenethyloxy-pyridin-2-yl]-acrylic acid SB-209247 | Ticolubant
Type:
Small organic molecule
Emp. Form.:
C23H19Cl2NO3S
Mol. Mass.:
460.373
SMILES:
OC(=O)\C=C\c1nc(CSc2c(Cl)cccc2Cl)ccc1OCCc1ccccc1
: