Target
Serine protease 1
Ligand
BDBM50052417
Substrate
Meas. Tech.
ChEMBL_212531 (CHEMBL815751)
Ki
2.9±n/a nM
Citation
 Costanzo, MJMaryanoff, BEHecker, LRSchott, MRYabut, SCZhang, HCAndrade-Gordon, PKauffman, JALewis, JMKrishnan, RTulinsky, A Potent thrombin inhibitors that probe the S1 subsite: tripeptide transition state analogues based on a heterocycle-activated carbonyl group. J Med Chem 39:3039-43 (1996)  
Target
Name:
Serine protease 1
Synonyms:
Beta-Trypsin PRSS1 TRY1 TRYP1 Trypsin I
Type:
Enzyme
Mol. Mass.:
25790.52
Organism:
Bos taurus (bovine)
Description:
P00760
Residue:
246
  
Inhibitor
Name:
BDBM50052417
Synonyms:
(S)-1-((R)-2-Methylamino-3-phenyl-propionyl)-pyrrolidine-2-carboxylic acid [(S)-1-(benzooxazole-2-carbonyl)-4-guanidino-butyl]-amide CHEMBL105584
Type:
Small organic molecule
Emp. Form.:
C28H35N7O4
Mol. Mass.:
533.622
SMILES:
CN[C@H](Cc1ccccc1)C(=O)N1CCC[C@H]1C(=O)N[C@@H](CCCNC(N)=N)C(=O)c1nc2ccccc2o1
: