Target
Neuronal acetylcholine receptor subunit alpha-4/beta-2
Ligand
BDBM50052593
Substrate
Meas. Tech.
ChEMBL_142742 (CHEMBL751478)
EC50
1800±n/a nM
Citation
 Cosford, NDBleicher, LHerbaut, AMcCallum, JSVernier, JMDawson, HWhitten, JPAdams, PChavez-Noriega, LCorrea, LDCrona, JHMahaffy, LSMenzaghi, FRao, TSReid, RSacaan, AISantori, EStauderman, KAWhelan, KLloyd, GKMcDonald, IA (S)-(-)-5-ethynyl-3-(1-methyl-2-pyrrolidinyl)pyridine maleate (SIB-1508Y): a novel anti-parkinsonian agent with selectivity for neuronal nicotinic acetylcholine receptors. J Med Chem 39:3235-7 (1996)  
Target
Name:
Neuronal acetylcholine receptor subunit alpha-4/beta-2
Synonyms:
Neuronal acetylcholine receptor Alpha-4/Beta-2 Neuronal acetylcholine receptor; alpha4/beta2 | nAChR subtypes alpha4 beta2
Type:
Protein
Mol. Mass.:
Description:
Components:
This complex has 2 components.
Component 1
Name:
Neuronal acetylcholine receptor subunit alpha-4
Synonyms:
ACHA4_HUMAN CHRNA4 protein Neuronal acetylcholine receptor protein alpha-4 subunit Nicotinic acetylcholine receptor alpha4/beta2/alpha5
Type:
Mol. Mass.:
69963.49
Organism:
Homo sapiens (Human)
Description:
NACHRA4
Residue:
627
  
Component 2
Name:
Neuronal acetylcholine receptor subunit beta-2
Synonyms:
ACHB2_HUMAN Neuronal acetylcholine receptor protein beta-2 subunit | Nicotinic acetylcholine receptor alpha3/beta2/alpha5
Type:
Protein
Mol. Mass.:
57020.50
Organism:
Homo sapiens (Human)
Description:
P17787
Residue:
502
  
Inhibitor
Name:
BDBM50052593
Synonyms:
3-Ethynyl-5-((S)-1-methyl-azetidin-2-yl)-pyridine Altinicline US10667515, Compound (S)-SIB 1508Y
Type:
Small organic molecule
Emp. Form.:
C12H14N2
Mol. Mass.:
186.253
SMILES:
CN1CCC[C@H]1c1cncc(c1)C#C
: