Target
Neuronal acetylcholine receptor subunit alpha-4/beta-4
Ligand
BDBM86544
Substrate
Meas. Tech.
ChEMBL_142745 (CHEMBL751264)
EC50
25000±n/a nM
Citation
 Cosford, NDBleicher, LHerbaut, AMcCallum, JSVernier, JMDawson, HWhitten, JPAdams, PChavez-Noriega, LCorrea, LDCrona, JHMahaffy, LSMenzaghi, FRao, TSReid, RSacaan, AISantori, EStauderman, KAWhelan, KLloyd, GKMcDonald, IA (S)-(-)-5-ethynyl-3-(1-methyl-2-pyrrolidinyl)pyridine maleate (SIB-1508Y): a novel anti-parkinsonian agent with selectivity for neuronal nicotinic acetylcholine receptors. J Med Chem 39:3235-7 (1996)  
Target
Name:
Neuronal acetylcholine receptor subunit alpha-4/beta-4
Synonyms:
Neuronal acetylcholine receptor protein alpha-4/beta-4 subunit | Neuronal acetylcholine receptor; alpha4/beta4
Type:
Mol. Mass.:
Description:
ASSAY_ID of EBI is 143890
Components:
This complex has 2 components.
Component 1
Name:
Neuronal acetylcholine receptor subunit beta-4
Synonyms:
ACHB4_HUMAN Cholinergic, Nicotinic Alpha6Beta3Beta4Alpha5 Nicotinic acetylcholine receptor alpha6/alpha3/beta4
Type:
Enzyme Catalytic Domain
Mol. Mass.:
56388.51
Organism:
Homo sapiens (Human)
Description:
Cholinergic, Nicotinic Alpha6Beta3Beta4Alpha5 0 HUMAN::P30926
Residue:
498
  
Component 2
Name:
Neuronal acetylcholine receptor subunit alpha-4
Synonyms:
ACHA4_HUMAN CHRNA4 protein Neuronal acetylcholine receptor protein alpha-4 subunit Nicotinic acetylcholine receptor alpha4/beta2/alpha5
Type:
Mol. Mass.:
69963.49
Organism:
Homo sapiens (Human)
Description:
NACHRA4
Residue:
627
  
Inhibitor
Name:
BDBM86544
Synonyms:
CAS_192231-16-6 NSC_6442277 | SIB-1508Y
Type:
Small organic molecule
Emp. Form.:
C12H14N2
Mol. Mass.:
186.253
SMILES:
CN1CCCC1c1cncc(c1)C#C
: