Target
Beta-lactamase
Ligand
BDBM50053173
Substrate
Meas. Tech.
ChEMBL_41044 (CHEMBL883285)
IC50
500±n/a nM
Citation
 Richter, HGAngehrn, PHubschwerlen, CKania, MPage, MGSpecklin, JLWinkler, FK Design, synthesis, and evaluation of 2 beta-alkenyl penam sulfone acids as inhibitors of beta-lactamases. J Med Chem 39:3712-22 (1996)  
Target
Name:
Beta-lactamase
Synonyms:
BLAC_STAAU Penicillinase | blaZ
Type:
PROTEIN
Mol. Mass.:
31367.53
Organism:
Staphylococcus aureus
Description:
ChEMBL_41052
Residue:
281
  
Inhibitor
Name:
BDBM50053173
Synonyms:
(2S,3S,5R)-3-Methyl-4,4,7-trioxo-3-[1,2,3]triazol-1-ylmethyl-4-thia-1-aza-bicyclo[3.2.0]heptane-2-carboxylic acid (2S,3S,5R)-3-methyl-4,4,7-trioxo-3-[1,2,3]triazol-1-ylmethyl-4lambda6-thia-1-aza-bicyclo[3.2.0]heptane-2-carboxylic acid 3-Methyl-4,4,7-trioxo-3-[1,2,3]triazol-1-ylmethyl-4lambda*6*-thia-1-aza-bicyclo[3.2.0]heptane-2-carboxylic acid CL-298741 US9120808, Tazobactam sodium salt YTR-830H | Zosyn
Type:
Small organic molecule
Emp. Form.:
C10H12N4O5S
Mol. Mass.:
300.291
SMILES:
C[C@]1(Cn2ccnn2)[C@@H](N2[C@@H](CC2=O)S1(=O)=O)C(O)=O
: