Target
Beta-lactamase
Ligand
BDBM50076680
Substrate
Meas. Tech.
ChEMBL_40255 (CHEMBL656485)
IC50
210±n/a nM
Citation
 Richter, HGAngehrn, PHubschwerlen, CKania, MPage, MGSpecklin, JLWinkler, FK Design, synthesis, and evaluation of 2 beta-alkenyl penam sulfone acids as inhibitors of beta-lactamases. J Med Chem 39:3712-22 (1996)  
Target
Name:
Beta-lactamase
Synonyms:
AMPC_CITFR ampC | blaC
Type:
PROTEIN
Mol. Mass.:
41983.84
Organism:
Citrobacter freundii
Description:
ChEMBL_40254
Residue:
381
  
Inhibitor
Name:
BDBM50076680
Synonyms:
CHEMBL6461 Sodium; (2S,3R,5R)-3-((Z)-2-cyano-vinyl)-3-methyl-4,4,7-trioxo-4lambda*6*-thia-1-aza-bicyclo[3.2.0]heptane-2-carboxylate | Sodium; (2S,3S,5R)-3-((Z)-2-cyano-vinyl)-3-methyl-4,4,7-trioxo-4lambda*6*-thia-1-aza-bicyclo[3.2.0]heptane-2-carboxylate
Type:
Small organic molecule
Emp. Form.:
C10H9N2O5S
Mol. Mass.:
269.254
SMILES:
C[C@]1(\C=C\C#N)[C@@H](N2[C@@H](CC2=O)S1(=O)=O)C([O-])=O
: