Target
Prostaglandin G/H synthase 1
Ligand
BDBM50339185
Substrate
Meas. Tech.
ChEMBL_158005 (CHEMBL768431)
IC50
21000±n/a nM
Citation
 Boehm, JCSmietana, JMSorenson, MEGarigipati, RSGallagher, TFSheldrake, PLBradbeer, JBadger, AMLaydon, JTLee, JCHillegass, LMGriswold, DEBreton, JJChabot-Fletcher, MCAdams, JL 1-substituted 4-aryl-5-pyridinylimidazoles: a new class of cytokine suppressive drugs with low 5-lipoxygenase and cyclooxygenase inhibitory potency. J Med Chem 39:3929-37 (1996)  
Target
Name:
Prostaglandin G/H synthase 1
Synonyms:
COX1 Cyclooxygenase-1 (COX-1) PTGS1 | Prostaglandin G/H synthase (cyclooxygenase)
Type:
Protein
Mol. Mass.:
68868.60
Organism:
Ovis aries (Sheep)
Description:
Residue:
600
  
Inhibitor
Name:
BDBM50339185
Synonyms:
(2S)-2-(6-methoxynaphthalen-2-yl)propanoic acid (S)-2-(6-methoxynaphthalen-2-yl)propanoic acid 2-(6-Methoxy-naphthalen-2-yl)-propionic acid 2-(6-methoxy-2-naphthyl)propanoic acid Aleve CHEMBL154 Equiproxen Naprosyn Naproxen2-(6-Methoxy-naphthalen-2-yl)-propionic acid S-NAPROXEN naproxene
Type:
Small organic molecule
Emp. Form.:
C14H14O3
Mol. Mass.:
230.2592
SMILES:
COc1ccc2cc(ccc2c1)[C@H](C)C(O)=O
: