Target
Transporter
Ligand
BDBM50053642
Substrate
Meas. Tech.
ChEMBL_142960 (CHEMBL750812)
IC50
90±n/a nM
Citation
 Blough, BEAbraham, PLewin, AHKuhar, MJBoja, JWCarroll, FI Synthesis and transporter binding properties of 3 beta-(4'-alkyl-, 4'-alkenyl-, and 4'-alkynylphenyl)nortropane-2 beta-carboxylic acid methyl esters: serotonin transporter selective analogs. J Med Chem 39:4027-35 (1996)  
Target
Name:
Transporter
Synonyms:
Monoamine transporters; Norepininephrine & dopamine | Norepinephrine Monoamine transporters
Type:
PROTEIN
Mol. Mass.:
66787.87
Organism:
Rattus norvegicus
Description:
ChEMBL_1463061
Residue:
597
  
Inhibitor
Name:
BDBM50053642
Synonyms:
3-(4-Allyl-phenyl)-8-aza-bicyclo[3.2.1]octane-2-carboxylic acid methyl ester | CHEMBL337507
Type:
Small organic molecule
Emp. Form.:
C18H23NO2
Mol. Mass.:
285.3807
SMILES:
COC(=O)C1C2CCC(CC1c1ccc(CC=C)cc1)N2
: