Target
D(4) dopamine receptor
Ligand
BDBM50053691
Substrate
Meas. Tech.
ChEMBL_61013 (CHEMBL675018)
IC50
713±n/a nM
Citation
 Hrib, NJJurcak, JGBregna, DEBurgher, KLHartman, HBKafka, SKerman, LLKongsamut, SRoehr, JESzewczak, MRWoods-Kettelberger, ATCorbett, R Structure-activity relationships of a series of novel (piperazinylbutyl)thiazolidinone antipsychotic agents related to 3-[4-[4-(6-fluorobenzo[b]thien-3-yl)-1-piperazinyl]butyl]-2,5,5- trimethyl-4-thiazolidinone maleate. J Med Chem 39:4044-57 (1996)  
Target
Name:
D(4) dopamine receptor
Synonyms:
D(2C) dopamine receptor DOPAMINE D4.2 DRD4 Dopamine D4 receptor
Type:
Enzyme
Mol. Mass.:
48373.19
Organism:
Homo sapiens (Human)
Description:
P21917
Residue:
419
  
Inhibitor
Name:
BDBM50053691
Synonyms:
3-{4-[4-(6-Fluoro-benzo[b]thiophen-3-yl)-piperazin-1-yl]-butyl}-2-methyl-1-thia-3-aza-spiro[4.4]nonan-4-one | CHEMBL131482
Type:
Small organic molecule
Emp. Form.:
C24H32FN3OS2
Mol. Mass.:
461.659
SMILES:
CC1SC2(CCCC2)C(=O)N1CCCCN1CCN(CC1)c1csc2cc(F)ccc12
: