Target
D(2) dopamine receptor
Ligand
BDBM50053716
Substrate
Meas. Tech.
ChEMBL_58683 (CHEMBL670247)
IC50
1610±n/a nM
Citation
 Hrib, NJJurcak, JGBregna, DEBurgher, KLHartman, HBKafka, SKerman, LLKongsamut, SRoehr, JESzewczak, MRWoods-Kettelberger, ATCorbett, R Structure-activity relationships of a series of novel (piperazinylbutyl)thiazolidinone antipsychotic agents related to 3-[4-[4-(6-fluorobenzo[b]thien-3-yl)-1-piperazinyl]butyl]-2,5,5- trimethyl-4-thiazolidinone maleate. J Med Chem 39:4044-57 (1996)  
Target
Name:
D(2) dopamine receptor
Synonyms:
DOPAMINE D2 DOPAMINE D2 Short Dopamine D2 receptor Drd2
Type:
G Protein-Coupled Receptor (GPCR)
Mol. Mass.:
50931.60
Organism:
Rattus norvegicus (rat)
Description:
P61169
Residue:
444
  
Inhibitor
Name:
BDBM50053716
Synonyms:
3-[4-(4-o-Tolyl-piperazin-1-yl)-butyl]-thiazolidin-4-one | CHEMBL129924
Type:
Small organic molecule
Emp. Form.:
C18H27N3OS
Mol. Mass.:
333.491
SMILES:
Cc1ccccc1N1CCN(CCCCN2CSCC2=O)CC1
: