Target
D(2) dopamine receptor
Ligand
BDBM50053734
Substrate
Meas. Tech.
ChEMBL_58562 (CHEMBL667497)
IC50
304±n/a nM
Citation
 Hrib, NJJurcak, JGBregna, DEBurgher, KLHartman, HBKafka, SKerman, LLKongsamut, SRoehr, JESzewczak, MRWoods-Kettelberger, ATCorbett, R Structure-activity relationships of a series of novel (piperazinylbutyl)thiazolidinone antipsychotic agents related to 3-[4-[4-(6-fluorobenzo[b]thien-3-yl)-1-piperazinyl]butyl]-2,5,5- trimethyl-4-thiazolidinone maleate. J Med Chem 39:4044-57 (1996)  
Target
Name:
D(2) dopamine receptor
Synonyms:
DOPAMINE D2 DOPAMINE D2 Short Dopamine D2 receptor Drd2
Type:
G Protein-Coupled Receptor (GPCR)
Mol. Mass.:
50931.60
Organism:
Rattus norvegicus (rat)
Description:
P61169
Residue:
444
  
Inhibitor
Name:
BDBM50053734
Synonyms:
3-{4-[4-(2-Methoxy-phenyl)-piperazin-1-yl]-butyl}-2,2,5,5-tetramethyl-thiazolidin-4-one | CHEMBL130906
Type:
Small organic molecule
Emp. Form.:
C22H35N3O2S
Mol. Mass.:
405.597
SMILES:
COc1ccccc1N1CCN(CCCCN2C(=O)C(C)(C)SC2(C)C)CC1
: