Target
5-hydroxytryptamine receptor 1A
Ligand
BDBM50053734
Substrate
Meas. Tech.
ChEMBL_831 (CHEMBL615831)
IC50
18±n/a nM
Citation
 Hrib, NJJurcak, JGBregna, DEBurgher, KLHartman, HBKafka, SKerman, LLKongsamut, SRoehr, JESzewczak, MRWoods-Kettelberger, ATCorbett, R Structure-activity relationships of a series of novel (piperazinylbutyl)thiazolidinone antipsychotic agents related to 3-[4-[4-(6-fluorobenzo[b]thien-3-yl)-1-piperazinyl]butyl]-2,5,5- trimethyl-4-thiazolidinone maleate. J Med Chem 39:4044-57 (1996)  
Target
Name:
5-hydroxytryptamine receptor 1A
Synonyms:
5-HT-1A 5-HT1A 5-hydroxytryptamine receptor 1A (5HT1A) 5ht1a Htr1a Serotonin 1a (5-HT1a) receptor/Adrenergic receptor alpha-1 | Serotonin receptor 1A
Type:
G Protein-Coupled Receptor (GPCR)
Mol. Mass.:
46445.29
Organism:
Rattus norvegicus (rat)
Description:
Binding assays were performed using rat hippocampal membranes.
Residue:
422
  
Inhibitor
Name:
BDBM50053734
Synonyms:
3-{4-[4-(2-Methoxy-phenyl)-piperazin-1-yl]-butyl}-2,2,5,5-tetramethyl-thiazolidin-4-one | CHEMBL130906
Type:
Small organic molecule
Emp. Form.:
C22H35N3O2S
Mol. Mass.:
405.597
SMILES:
COc1ccccc1N1CCN(CCCCN2C(=O)C(C)(C)SC2(C)C)CC1
: