Target
5-hydroxytryptamine receptor 1A
Ligand
BDBM50053724
Substrate
Meas. Tech.
ChEMBL_831 (CHEMBL615831)
IC50
8±n/a nM
Citation
 Hrib, NJJurcak, JGBregna, DEBurgher, KLHartman, HBKafka, SKerman, LLKongsamut, SRoehr, JESzewczak, MRWoods-Kettelberger, ATCorbett, R Structure-activity relationships of a series of novel (piperazinylbutyl)thiazolidinone antipsychotic agents related to 3-[4-[4-(6-fluorobenzo[b]thien-3-yl)-1-piperazinyl]butyl]-2,5,5- trimethyl-4-thiazolidinone maleate. J Med Chem 39:4044-57 (1996)  
Target
Name:
5-hydroxytryptamine receptor 1A
Synonyms:
5-HT-1A 5-HT1A 5-hydroxytryptamine receptor 1A (5HT1A) 5ht1a Htr1a Serotonin 1a (5-HT1a) receptor/Adrenergic receptor alpha-1 | Serotonin receptor 1A
Type:
G Protein-Coupled Receptor (GPCR)
Mol. Mass.:
46445.29
Organism:
Rattus norvegicus (rat)
Description:
Binding assays were performed using rat hippocampal membranes.
Residue:
422
  
Inhibitor
Name:
BDBM50053724
Synonyms:
3-[4-(4-Benzo[d]isothiazol-3-yl-piperazin-1-yl)-butyl]-5,5-dimethyl-thiazolidin-4-one | CHEMBL130788
Type:
Small organic molecule
Emp. Form.:
C20H28N4OS2
Mol. Mass.:
404.593
SMILES:
CC1(C)SCN(CCCCN2CCN(CC2)c2nsc3ccccc23)C1=O
: