Target
D(2) dopamine receptor
Ligand
BDBM50020503
Substrate
Meas. Tech.
ChEMBL_61649 (CHEMBL670173)
Ki
3.3±n/a nM
Citation
 van Vliet, LATepper, PGDijkstra, DDamsma, GWikström, HPugsley, TAAkunne, HCHeffner, TGGlase, SAWise, LD Affinity for dopamine D2, D3, and D4 receptors of 2-aminotetralins. Relevance of D2 agonist binding for determination of receptor subtype selectivity. J Med Chem 39:4233-7 (1996)  
Target
Name:
D(2) dopamine receptor
Synonyms:
D(2) dopamine receptor DOPAMINE D2 Long DRD2 Dopamine D2 receptor Dopamine D2 receptor (D2R) Dopamine2-like | d2
Type:
Cell-surface receptors
Mol. Mass.:
50647.10
Organism:
Homo sapiens (Human)
Description:
P14416
Residue:
443
  
Inhibitor
Name:
BDBM50020503
Synonyms:
7-Amino-5,6,7,8-tetrahydro-naphthalen-2-ol | CHEMBL133830
Type:
Small organic molecule
Emp. Form.:
C10H13NO
Mol. Mass.:
163.2163
SMILES:
NC1CCc2ccc(O)cc2C1
: