Target
D(3) dopamine receptor
Ligand
BDBM50020511
Substrate
Meas. Tech.
ChEMBL_62265 (CHEMBL675667)
Ki
343±n/a nM
Citation
 van Vliet, LATepper, PGDijkstra, DDamsma, GWikström, HPugsley, TAAkunne, HCHeffner, TGGlase, SAWise, LD Affinity for dopamine D2, D3, and D4 receptors of 2-aminotetralins. Relevance of D2 agonist binding for determination of receptor subtype selectivity. J Med Chem 39:4233-7 (1996)  
Target
Name:
D(3) dopamine receptor
Synonyms:
DOPAMINE D3 DRD3_HUMAN Dopamine D3 receptor (D3) Dopamine receptor Dopamine receptor D3
Type:
Mol. Mass.:
44243.43
Organism:
Homo sapiens (Human)
Description:
Residue:
400
  
Inhibitor
Name:
BDBM50020511
Synonyms:
6-Amino-5,6,7,8-tetrahydro-naphthalen-1-ol | CHEMBL441092
Type:
Small organic molecule
Emp. Form.:
C10H13NO
Mol. Mass.:
163.2163
SMILES:
NC1CCc2c(O)cccc2C1
: