Target
D(2) dopamine receptor
Ligand
BDBM50054076
Substrate
Meas. Tech.
ChEMBL_61782 (CHEMBL670536)
Ki
55±n/a nM
Citation
 van Vliet, LATepper, PGDijkstra, DDamsma, GWikström, HPugsley, TAAkunne, HCHeffner, TGGlase, SAWise, LD Affinity for dopamine D2, D3, and D4 receptors of 2-aminotetralins. Relevance of D2 agonist binding for determination of receptor subtype selectivity. J Med Chem 39:4233-7 (1996)  
Target
Name:
D(2) dopamine receptor
Synonyms:
D(2) dopamine receptor DOPAMINE D2 Long DRD2 Dopamine D2 receptor Dopamine D2 receptor (D2R) Dopamine2-like | d2
Type:
Cell-surface receptors
Mol. Mass.:
50647.10
Organism:
Homo sapiens (Human)
Description:
P14416
Residue:
443
  
Inhibitor
Name:
BDBM50054076
Synonyms:
7-Dimethylamino-5,6,7,8-tetrahydro-naphthalen-2-ol | CHEMBL135932
Type:
Small organic molecule
Emp. Form.:
C12H17NO
Mol. Mass.:
191.2695
SMILES:
CN(C)C1CCc2ccc(O)cc2C1
: