Target
D(2) dopamine receptor
Ligand
BDBM50054088
Substrate
Meas. Tech.
ChEMBL_62239 (CHEMBL671571)
Ki
0.34±n/a nM
Citation
 Claudi, FCingolani, GMDi Stefano, AGiorgioni, GAmenta, FBarili, PFerrari, FGiuliani, D Synthesis, resolution, and preliminary evaluation of trans-2-amino-6(5)-hydroxy-1-phenyl-2,3-dihydro-1H-indenes and related derivatives as dopamine receptors ligands. J Med Chem 39:4238-46 (1996)  
Target
Name:
D(2) dopamine receptor
Synonyms:
DOPAMINE D2 DOPAMINE D2 Short Dopamine D2 receptor Drd2
Type:
G Protein-Coupled Receptor (GPCR)
Mol. Mass.:
50931.60
Organism:
Rattus norvegicus (rat)
Description:
P61169
Residue:
444
  
Inhibitor
Name:
BDBM50054088
Synonyms:
(2R,3R)-2-(Methyl-propyl-amino)-3-phenyl-indan-5-ol | CHEMBL433652
Type:
Small organic molecule
Emp. Form.:
C19H23NO
Mol. Mass.:
281.392
SMILES:
CCCN(C)[C@@H]1Cc2ccc(O)cc2[C@H]1c1ccccc1
: