Target
D(2) dopamine receptor
Ligand
BDBM50054093
Substrate
Meas. Tech.
ChEMBL_62239 (CHEMBL671571)
Ki
>1000±n/a nM
Citation
 Claudi, FCingolani, GMDi Stefano, AGiorgioni, GAmenta, FBarili, PFerrari, FGiuliani, D Synthesis, resolution, and preliminary evaluation of trans-2-amino-6(5)-hydroxy-1-phenyl-2,3-dihydro-1H-indenes and related derivatives as dopamine receptors ligands. J Med Chem 39:4238-46 (1996)  
Target
Name:
D(2) dopamine receptor
Synonyms:
DOPAMINE D2 DOPAMINE D2 Short Dopamine D2 receptor Drd2
Type:
G Protein-Coupled Receptor (GPCR)
Mol. Mass.:
50931.60
Organism:
Rattus norvegicus (rat)
Description:
P61169
Residue:
444
  
Inhibitor
Name:
BDBM50054093
Synonyms:
(1R,2R)-2-Amino-1,2-dimethyl-1-phenyl-indan-5,6-diol | CHEMBL132766
Type:
Small organic molecule
Emp. Form.:
C17H19NO2
Mol. Mass.:
269.3383
SMILES:
C[C@@]1(N)Cc2cc(O)c(O)cc2[C@@]1(C)c1ccccc1
: