Target
D(1A) dopamine receptor
Ligand
BDBM50054085
Substrate
Meas. Tech.
ChEMBL_58656 (CHEMBL670430)
Ki
19±n/a nM
Citation
 Claudi, FCingolani, GMDi Stefano, AGiorgioni, GAmenta, FBarili, PFerrari, FGiuliani, D Synthesis, resolution, and preliminary evaluation of trans-2-amino-6(5)-hydroxy-1-phenyl-2,3-dihydro-1H-indenes and related derivatives as dopamine receptors ligands. J Med Chem 39:4238-46 (1996)  
Target
Name:
D(1A) dopamine receptor
Synonyms:
DOPAMINE D1 Dopamine D1 high Dopamine receptor Dopamine1-like Drd1a
Type:
Enzyme Catalytic Domain
Mol. Mass.:
49429.75
Organism:
RAT
Description:
P18901
Residue:
446
  
Inhibitor
Name:
BDBM50054085
Synonyms:
(1R,2R)-2-Amino-1-phenyl-indan-5-ol | CHEMBL336366
Type:
Small organic molecule
Emp. Form.:
C15H15NO
Mol. Mass.:
225.2857
SMILES:
N[C@@H]1Cc2cc(O)ccc2[C@H]1c1ccccc1
: