Target
Aldo-keto reductase family 1 member B1 [K65Q]
Ligand
BDBM16312
Substrate
Meas. Tech.
ChEMBL_32263 (CHEMBL645597)
IC50
3040±n/a nM
Citation
 Costantino, LRastelli, GVescovini, KCignarella, GVianello, PDel Corso, ACappiello, MMura, UBarlocco, D Synthesis, activity, and molecular modeling of a new series of tricyclic pyridazinones as selective aldose reductase inhibitors. J Med Chem 39:4396-405 (1996)  
Target
Name:
Aldo-keto reductase family 1 member B1 [K65Q]
Synonyms:
AKR1B1 Aldose reductase
Type:
Protein
Mol. Mass.:
35916.27
Organism:
Bos taurus (Cattle)
Description:
P16116[K65Q]
Residue:
315
  
Inhibitor
Name:
BDBM16312
Synonyms:
(4S)-6-fluoro-2,3-dihydrospiro[1-benzopyran-4,4'-imidazolidine]-2',5'-dione Sorbinil
Type:
Small organic molecule
Emp. Form.:
C11H9FN2O3
Mol. Mass.:
236.1992
SMILES:
Fc1ccc2OCC[C@]3(NC(=O)NC3=O)c2c1
: