Target
Adenosine receptor A2a
Ligand
BDBM50054681
Substrate
Meas. Tech.
ChEMBL_30922 (CHEMBL647732)
Ki
28400±n/a nM
Citation
 Jiang, JLvan Rhee, AMMelman, NJi, XDJacobson, KA 6-phenyl-1,4-dihydropyridine derivatives as potent and selective A3 adenosine receptor antagonists. J Med Chem 39:4667-75 (1996)  
Target
Name:
Adenosine receptor A2a
Synonyms:
AA2AR_RAT Adenosine A2 receptor Adenosine Receptors A2a (A2a) Adenosine receptors A2a Rat striatal adenosine A2a receptor
Type:
G Protein-Coupled Receptor (GPCR)
Mol. Mass.:
45015.65
Organism:
Rattus norvegicus (rat)
Description:
Rat A2A receptors expressed in CHO cells.
Residue:
410
  
Inhibitor
Name:
BDBM50054681
Synonyms:
2,4-Dimethyl-6-phenyl-pyridine-3,5-dicarboxylic acid diethyl ester diethyl 2,4-dimethyl-6-phenylpyridine-3,5-dicarboxylate
Type:
Small organic molecule
Emp. Form.:
C19H21NO4
Mol. Mass.:
327.3743
SMILES:
CCOC(=O)c1c(C)nc(-c2ccccc2)c(C(=O)OCC)c1C
: