Target
Thymidine kinase
Ligand
BDBM50054772
Substrate
Meas. Tech.
ChEMBL_208012 (CHEMBL816092)
IC50
2900±n/a nM
Citation
 De Winter, HHerdewijn, P Understanding the binding of 5-substituted 2'-deoxyuridine substrates to thymidine kinase of herpes simplex virus type-1. J Med Chem 39:4727-37 (1997)  
Target
Name:
Thymidine kinase
Synonyms:
KITH_HHV1S Thymidine kinase | UL23
Type:
PROTEIN
Mol. Mass.:
40883.42
Organism:
Human herpesvirus 1 (strain SC16) (HHV-1) (Human herpes simplex virus1)
Description:
ChEMBL_213
Residue:
376
  
Inhibitor
Name:
BDBM50054772
Synonyms:
5-Furan-2-yl-1-(4-hydroxy-5-hydroxymethyl-tetrahydro-furan-2-yl)-1H-pyrimidine-2,4-dione | CHEMBL2367583
Type:
Small organic molecule
Emp. Form.:
C13H14N2O6
Mol. Mass.:
294.2601
SMILES:
OC[C@H]1O[C@H](C[C@@H]1O)n1cc(-c2ccco2)c(=O)[nH]c1=O
: