Target
Proteinase-activated receptor 1
Ligand
BDBM50054909
Substrate
Meas. Tech.
ChEMBL_209251 (CHEMBL815692)
IC50
28±n/a nM
Citation
 Bernatowicz, MSKlimas, CEHartl, KSPeluso, MAllegretto, NJSeiler, SM Development of potent thrombin receptor antagonist peptides. J Med Chem 39:4879-87 (1997)  
Target
Name:
Proteinase-activated receptor 1
Synonyms:
CF2R F2R PAR1 Proteinase activated receptor 1 TR Thrombin receptor/ Proteinase-activated receptor 1(Par-1)
Type:
Protein
Mol. Mass.:
47450.07
Organism:
Homo sapiens (Human)
Description:
P25116
Residue:
425
  
Inhibitor
Name:
BDBM50054909
Synonyms:
2-{(R)-2-[2-{Acetyl-[(E)-(3-phenyl-acryloyl)]-amino}-3-(4-fluoro-phenyl)-propionylamino]-4-guanidino-butyrylamino}-4-methyl-pentanoic acid (1-carbamoyl-4-guanidino-butyl)-amide | CHEMBL144361
Type:
Small organic molecule
Emp. Form.:
C37H52FN11O6
Mol. Mass.:
765.8773
SMILES:
CC(C)CC(NC(=O)[C@@H](CCNC(N)=N)NC(=O)C(Cc1ccc(F)cc1)N(C(C)=O)C(=O)C=Cc1ccccc1)C(=O)NC(CCCNC(N)=N)C(N)=O
: