Target
Proteinase-activated receptor 1
Ligand
BDBM50054940
Substrate
Meas. Tech.
ChEMBL_209251 (CHEMBL815692)
IC50
26±n/a nM
Citation
 Bernatowicz, MSKlimas, CEHartl, KSPeluso, MAllegretto, NJSeiler, SM Development of potent thrombin receptor antagonist peptides. J Med Chem 39:4879-87 (1997)  
Target
Name:
Proteinase-activated receptor 1
Synonyms:
CF2R F2R PAR1 Proteinase activated receptor 1 TR Thrombin receptor/ Proteinase-activated receptor 1(Par-1)
Type:
Protein
Mol. Mass.:
47450.07
Organism:
Homo sapiens (Human)
Description:
P25116
Residue:
425
  
Inhibitor
Name:
BDBM50054940
Synonyms:
CHEMBL177249 | N-[1-[1-[1-(1-Carbamoyl-4-guanidino-butylcarbamoyl)-3-methyl-butylcarbamoyl]-2-(4-guanidino-phenyl)-ethylcarbamoyl]-2-(4-fluoro-phenyl)-ethyl]-4-chloro-benzamide
Type:
Small organic molecule
Emp. Form.:
C38H49ClFN11O5
Mol. Mass.:
794.318
SMILES:
[#6]-[#6](-[#6])-[#6]-[#6](-[#7]-[#6](=O)-[#6](-[#6]-c1ccc(cc1)\[#7]=[#6](\[#7])-[#7])-[#7]-[#6](=O)-[#6](-[#6]-c1ccc(F)cc1)-[#7]-[#6](=O)-c1ccc(Cl)cc1)-[#6](=O)-[#7]-[#6](-[#6]-[#6]-[#6]-[#7]-[#6](-[#7])=[#7])-[#6](-[#7])=O
: