Target
Proteinase-activated receptor 1
Ligand
BDBM50054870
Substrate
Meas. Tech.
ChEMBL_209251 (CHEMBL815692)
IC50
24±n/a nM
Citation
 Bernatowicz, MSKlimas, CEHartl, KSPeluso, MAllegretto, NJSeiler, SM Development of potent thrombin receptor antagonist peptides. J Med Chem 39:4879-87 (1997)  
Target
Name:
Proteinase-activated receptor 1
Synonyms:
CF2R F2R PAR1 Proteinase activated receptor 1 TR Thrombin receptor/ Proteinase-activated receptor 1(Par-1)
Type:
Protein
Mol. Mass.:
47450.07
Organism:
Homo sapiens (Human)
Description:
P25116
Residue:
425
  
Inhibitor
Name:
BDBM50054870
Synonyms:
1H-Indole-2-carboxylic acid [1-[1-[1-(1-carbamoyl-4-guanidino-butylcarbamoyl)-3-methyl-butylcarbamoyl]-2-(4-guanidino-phenyl)-ethylcarbamoyl]-2-(4-fluoro-phenyl)-ethyl]-amide | CHEMBL407822
Type:
Small organic molecule
Emp. Form.:
C40H51FN12O5
Mol. Mass.:
798.9087
SMILES:
CC(C)CC(NC(=O)C(Cc1ccc(cc1)N=C(N)N)NC(=O)C(Cc1ccc(F)cc1)NC(=O)c1cc2ccccc2[nH]1)C(=O)NC(CCCNC(N)=N)C(N)=O
: