Target
D(2) dopamine receptor
Ligand
BDBM50033839
Substrate
Meas. Tech.
ChEMBL_58563 (CHEMBL667498)
IC50
18±n/a nM
Citation
 Perrone, RBerardi, FColabufo, NALeopoldo, MTortorella, VFornaretto, MGCaccia, CMcArthur, RA Structure-activity relationship studies on the 5-HT(1A) receptor affinity of 1-phenyl-4-[omega-(alpha- or beta-tetralinyl)alkyl]piperazines. 4. J Med Chem 39:4928-34 (1997)  
Target
Name:
D(2) dopamine receptor
Synonyms:
DOPAMINE D2 DOPAMINE D2 Short Dopamine D2 receptor Drd2
Type:
G Protein-Coupled Receptor (GPCR)
Mol. Mass.:
50931.60
Organism:
Rattus norvegicus (rat)
Description:
P61169
Residue:
444
  
Inhibitor
Name:
BDBM50033839
Synonyms:
1-(2-Methoxy-phenyl)-4-[3-(5-methoxy-1,2,3,4-tetrahydro-naphthalen-1-yl)-propyl]-piperazine | CHEMBL26929
Type:
Small organic molecule
Emp. Form.:
C25H34N2O2
Mol. Mass.:
394.5497
SMILES:
COc1cccc2C(CCCN3CCN(CC3)c3ccccc3OC)CCCc12
: