Target
Acetylcholinesterase
Ligand
BDBM50055186
Substrate
Meas. Tech.
ChEMBL_28124 (CHEMBL644382)
IC50
973±n/a nM
Citation
 Cho, SJGarsia, MLBier, JTropsha, A Structure-based alignment and comparative molecular field analysis of acetylcholinesterase inhibitors. J Med Chem 39:5064-71 (1997)  
Target
Name:
Acetylcholinesterase
Synonyms:
ACES_ELEEL Acetylcholinesterase (EeAChE) | ache
Type:
Enzyme
Mol. Mass.:
71812.79
Organism:
Electrophorus electricus (Electric eel)
Description:
Residue:
633
  
Inhibitor
Name:
BDBM50055186
Synonyms:
(3-Hydroxy-phenyl)-trimethyl-ammonium CHEMBL422459
Type:
Small organic molecule
Emp. Form.:
C9H14NO
Mol. Mass.:
152.213
SMILES:
C[N+](C)(C)c1cccc(O)c1
: