Target
Acetylcholinesterase
Ligand
BDBM50055160
Substrate
Meas. Tech.
ChEMBL_28625 (CHEMBL642295)
IC50
40000±n/a nM
Citation
 Cho, SJGarsia, MLBier, JTropsha, A Structure-based alignment and comparative molecular field analysis of acetylcholinesterase inhibitors. J Med Chem 39:5064-71 (1997)  
Target
Name:
Acetylcholinesterase
Synonyms:
ACES_HUMAN Acetylcholinesterase (AChE) | Acetylcholinesterase (human AChE)
Type:
Enzyme
Mol. Mass.:
67792.70
Organism:
Homo sapiens (Human)
Description:
P22303
Residue:
614
  
Inhibitor
Name:
BDBM50055160
Synonyms:
(S)-5-Diethylcarbamoyloxy-1,3a,8-trimethyl-1,2,3,3a,8,8a-hexahydro-pyrrolo[2,3-b]indol-1-ium
Type:
Small organic molecule
Emp. Form.:
C18H28N3O2
Mol. Mass.:
318.4333
SMILES:
CCN(CC)C(=O)Oc1ccc2N(C)C3[N@H+](C)CC[C@@]3(C)c2c1
: