Target
Acetylcholinesterase
Ligand
BDBM50055168
Substrate
Meas. Tech.
ChEMBL_27805 (CHEMBL636515)
IC50
1730000±n/a nM
Citation
 Cho, SJGarsia, MLBier, JTropsha, A Structure-based alignment and comparative molecular field analysis of acetylcholinesterase inhibitors. J Med Chem 39:5064-71 (1997)  
Target
Name:
Acetylcholinesterase
Synonyms:
3.1.1.7 Acetylcholinesterase (AChE) ache
Type:
Mol. Mass.:
65900.74
Organism:
Tetronarce californica (Pacific electric ray) (Torpedo californica)
Description:
P04058
Residue:
586
  
Inhibitor
Name:
BDBM50055168
Synonyms:
(S)-2-Hydroxy-2,4,4-trimethyl-morpholin-4-ium; bromide CHEMBL342903
Type:
Small organic molecule
Emp. Form.:
C7H16NO2
Mol. Mass.:
146.2069
SMILES:
C[C@@]1(O)C[N+](C)(C)CCO1
: