Target
Acetylcholinesterase
Ligand
BDBM50022775
Substrate
Meas. Tech.
ChEMBL_28625 (CHEMBL642295)
IC50
91.0±n/a nM
Citation
 Cho, SJGarsia, MLBier, JTropsha, A Structure-based alignment and comparative molecular field analysis of acetylcholinesterase inhibitors. J Med Chem 39:5064-71 (1997)  
Target
Name:
Acetylcholinesterase
Synonyms:
ACES_HUMAN Acetylcholinesterase (AChE) | Acetylcholinesterase (human AChE)
Type:
Enzyme
Mol. Mass.:
67792.70
Organism:
Homo sapiens (Human)
Description:
P22303
Residue:
614
  
Inhibitor
Name:
BDBM50022775
Synonyms:
(m-Hydroxyphenyl)trimethylammonium dimethylcarbamate 3-[(dimethylcarbamoyl)oxy]-N,N,N-trimethylanilinium CHEMBL278020 Eustigmine Neostigmine (2) Vagostigmine | m-Trimethylammoniumphenyldimethylcarbamate
Type:
Small organic molecule
Emp. Form.:
C12H19N2O2
Mol. Mass.:
223.2909
SMILES:
CN(C)C(=O)Oc1cccc(c1)[N+](C)(C)C
: