Target
Substance-K receptor
Ligand
BDBM50079412
Substrate
Meas. Tech.
ChEMBL_208853 (CHEMBL816688)
IC50
3.6±n/a nM
Citation
 Boden, PEden, JMHodgson, JHorwell, DCHughes, JMcKnight, ATLewthwaite, RAPritchard, MCRaphy, JMeecham, KRatcliffe, GSSuman-Chauhan, NWoodruff, GN Use of a dipeptide chemical library in the development of non-peptide tachykinin NK3 receptor selective antagonists. J Med Chem 39:1664-75 (1996)  
Target
Name:
Substance-K receptor
Synonyms:
NK2R_MESAU Neurokinin NK2 TACR2
Type:
Enzyme Catalytic Domain
Mol. Mass.:
43436.75
Organism:
HAMSTER
Description:
P51144
Residue:
384
  
Inhibitor
Name:
BDBM50079412
Synonyms:
(NKB)Asp-Met-His-Asp-Phe-Phe-Val-Gly-Leu-Met-NH2 Asp-Met-His-Asp-Phe-Phe-Val-Gly-Leu-Met-NH2(Neurokinin B) NKB | Neurokinin B
Type:
Small organic molecule
Emp. Form.:
C55H79N13O14S2
Mol. Mass.:
1210.424
SMILES:
CSCC[C@H](NC(=O)[C@H](CC(C)C)NC(=O)CNC(=O)[C@@H](NC(=O)[C@H](Cc1ccccc1)NC(=O)[C@H](Cc1ccccc1)NC(=O)[C@H](CC(O)=O)NC(=O)[C@H](Cc1cnc[nH]1)NC(=O)[C@H](CCSC)NC(=O)[C@@H](N)CC(O)=O)C(C)C)C(N)=O
: