Target
Delta-type opioid receptor
Ligand
BDBM50049563
Substrate
Meas. Tech.
ChEMBL_147136 (CHEMBL754168)
Ki
183±n/a nM
Citation
 Bolognesi, MLOjala, WHGleason, WBGriffin, JFFarouz-Grant, FLarson, DLTakemori, AEPortoghese, PS Opioid antagonist activity of naltrexone-derived bivalent ligands: importance of a properly oriented molecular scaffold to guide"address" recognition at kappa opioid receptors. J Med Chem 39:1816-22 (1996)  
Target
Name:
Delta-type opioid receptor
Synonyms:
D-OR-1 Delta opioid receptor OPIATE Delta OPRD1 OPRK1 | opioid receptor, delta 1
Type:
G Protein-Coupled Receptor (GPCR)
Mol. Mass.:
40382.98
Organism:
Homo sapiens (Human)
Description:
Competition binding assays were carried out using membrane preparations from transfected HN9.10 cells that constitutively expressed the delta opioid receptor.
Residue:
372
  
Inhibitor
Name:
BDBM50049563
Synonyms:
5-amino-2,4(Bis-4-cyclopropylmethyl-10,17-dihydroxy-(1S,5R,13R,17S)-12-oxa-4-azapentacyclo[9.6.1.01,13.05,17.07,18]octadeca-7(18),8,10-trien-14-one) imidazole | CHEMBL299772
Type:
Small organic molecule
Emp. Form.:
C42H50N6O6
Mol. Mass.:
734.883
SMILES:
NC1=NC(=N[C@]11CC[C@@]2(O)[C@H]3Cc4ccc(O)c5O[C@@H]1C2(CCN3CC1CC1)c45)[C@]1(N)CC[C@@]2(O)[C@H]3Cc4ccc(O)c5O[C@@H]1C2(CCN3CC1CC1)c45
: