Target
Muscarinic receptor M1
Ligand
BDBM50055976
Substrate
Meas. Tech.
ChEMBL_140161 (CHEMBL745466)
Ki
0.01±n/a nM
Citation
 Visser, TJvan Waarde, AJansen, TJVisser, GMvan der Mark, TWKraan, JEnsing, KVaalburg, W Stereoselective synthesis and biodistribution of potent [11C]-labeled antagonists for positron emission tomography imaging of muscarinic receptors in the airways. J Med Chem 40:117-24 (1997)  
Target
Name:
Muscarinic receptor M1
Synonyms:
Muscarinic acetylcholine receptor M1
Type:
PROTEIN
Mol. Mass.:
15022.43
Organism:
Bos taurus
Description:
ChEMBL_140161
Residue:
139
  
Inhibitor
Name:
BDBM50055976
Synonyms:
(R)-3-((R)-2-Cyclohexyl-2-hydroxy-2-phenyl-acetoxy)-1-methyl-1-azonia-bicyclo[2.2.2]octane; iodide | CHEMBL21812
Type:
Small organic molecule
Emp. Form.:
C22H32NO3
Mol. Mass.:
358.4938
SMILES:
C[N+]12CCC(CC1)[C@H](C2)OC(=O)[C@@](O)(C1CCCCC1)c1ccccc1
: