Target
Adenosylhomocysteinase
Ligand
BDBM50051435
Substrate
Meas. Tech.
ChEMBL_196553 (CHEMBL801948)
Ki
39±n/a nM
Citation
 Wnuk, SFYuan, CSBorchardt, RTBalzarini, JDe Clercq, ERobins, MJ Anticancer and antiviral effects and inactivation of S-adenosyl-L-homocysteine hydrolase with 5'-carboxaldehydes and oximes synthesized from adenosine and sugar-modified analogues. J Med Chem 40:1608-18 (1997)  
Target
Name:
Adenosylhomocysteinase
Synonyms:
AHCY SAHH | SAHH_HUMAN
Type:
PROTEIN
Mol. Mass.:
47714.06
Organism:
Homo sapiens (Human)
Description:
ChEMBL_1507791
Residue:
432
  
Inhibitor
Name:
BDBM50051435
Synonyms:
5'-Dehydroadenosine 9-beta-D-ribo-pentodialdo-1,4-furanosyl-9H-purin-6-amine | CHEMBL308037
Type:
Small organic molecule
Emp. Form.:
C10H11N5O4
Mol. Mass.:
265.2254
SMILES:
Nc1ncnc2n(cnc12)[C@@H]1O[C@H](C=O)[C@@H](O)[C@H]1O
: