Target
Delta-type opioid receptor
Ligand
BDBM50059842
Substrate
Meas. Tech.
ChEMBL_147182 (CHEMBL754481)
Ki
9500±n/a nM
Citation
 Tomatis, RMarastoni, MBalboni, GGuerrini, RCapasso, ASorrentino, LSantagada, VCaliendo, GLazarus, LHSalvadori, S Synthesis and pharmacological activity of deltorphin and dermorphin-related glycopeptides. J Med Chem 40:2948-52 (1997)  
Target
Name:
Delta-type opioid receptor
Synonyms:
Cytochrome P450 3A4 Delta opioid receptor Delta-type opioid receptor (DOR) OPRD_RAT Opioid receptor Opioid receptors; mu & delta Ror-a | Voltage-gated potassium channel
Type:
G Protein-Coupled Receptor (GPCR)
Mol. Mass.:
40465.04
Organism:
Rattus norvegicus (rat)
Description:
Competition binding assays were using CHO-K1 cell membranes expressing the opioid receptor.
Residue:
372
  
Inhibitor
Name:
BDBM50059842
Synonyms:
2-(2-{2-[2-Amino-3-(4-hydroxy-phenyl)-propionylamino]-propionylamino}-3-phenyl-propionylamino)-N-{1-[1-(carbamoylmethyl-carbamoyl)-2-methyl-propylcarbamoyl]-2-methyl-propyl}-3-(3,4,5-trihydroxy-6-hydroxymethyl-tetrahydro-pyran-2-yloxy)-butyramide | CHEMBL2370332
Type:
Small organic molecule
Emp. Form.:
C43H64N8O14
Mol. Mass.:
917.0135
SMILES:
CC(C)[C@H](NC(=O)[C@@H](NC(=O)[C@@H](NC(=O)[C@H](Cc1ccccc1)NC(=O)[C@@H](C)NC(=O)[C@@H](N)Cc1ccc(O)cc1)[C@@H](C)O[C@H]1O[C@H](CO)[C@@H](O)[C@@H](O)[C@H]1O)C(C)C)C(=O)NCC(N)=O
: