Target
Prothrombin
Ligand
BDBM50060029
Substrate
Meas. Tech.
ChEMBL_210595 (CHEMBL816562)
Ki
12±n/a nM
Citation
 Stürzebecher, JPrasa, DHauptmann, JVieweg, HWikström, P Synthesis and structure-activity relationships of potent thrombin inhibitors: piperazides of 3-amidinophenylalanine. J Med Chem 40:3091-9 (1997)  
Target
Name:
Prothrombin
Synonyms:
Activation peptide fragment 1 Coagulation factor II Prothrombin Thrombin Thrombin light chain
Type:
Enzyme
Mol. Mass.:
70502.73
Organism:
Bos taurus (Bovine)
Description:
P00735
Residue:
625
  
Inhibitor
Name:
BDBM50060029
Synonyms:
3-[(R)-3-(4-Acetyl-piperazin-1-yl)-2-(naphthalene-2-sulfonylamino)-3-oxo-propyl]-benzamidine | CHEMBL322901
Type:
Small organic molecule
Emp. Form.:
C26H29N5O4S
Mol. Mass.:
507.605
SMILES:
CC(=O)N1CCN(CC1)C(=O)[C@@H](Cc1cccc(c1)C(N)=N)NS(=O)(=O)c1ccc2ccccc2c1
: