Target
Delta-type opioid receptor
Ligand
BDBM50218796
Substrate
Meas. Tech.
ChEMBL_146321 (CHEMBL757530)
Ki
0.800000±n/a nM
Citation
 Dondio, GRonzoni, SEggleston, DSArtico, MPetrillo, PPetrone, GVisentin, LFarina, CVecchietti, VClarke, GD Discovery of a novel class of substituted pyrrolooctahydroisoquinolines as potent and selective delta opioid agonists, based on an extension of the message-address concept. J Med Chem 40:3192-8 (1997)  
Target
Name:
Delta-type opioid receptor
Synonyms:
DOR-1 MSL-2 OPRD_MOUSE Oprd1
Type:
Enzyme Catalytic Domain
Mol. Mass.:
40577.25
Organism:
MOUSE
Description:
P32300
Residue:
372
  
Inhibitor
Name:
BDBM50218796
Synonyms:
CHEMBL557978 oxymorphindole
Type:
Small organic molecule
Emp. Form.:
C23H22N2O3
Mol. Mass.:
374.4324
SMILES:
CN1CC[C@@]23[C@H]4Oc5c2c(C[C@@H]1[C@]3(O)Cc1c4[nH]c2ccccc12)ccc5O
: