Target
D(2) dopamine receptor
Ligand
BDBM50060601
Substrate
Meas. Tech.
ChEMBL_59492 (CHEMBL670144)
Ki
60±n/a nM
Citation
 Baures, PWOjala, WHCostain, WJOtt, MCPradhan, AGleason, WBMishra, RKJohnson, RL Design, synthesis, and dopamine receptor modulating activity of diketopiperazine peptidomimetics of L-prolyl-L-leucylglycinamide. J Med Chem 40:3594-600 (1997)  
Target
Name:
D(2) dopamine receptor
Synonyms:
DOPAMINE D2 DRD2_BOVIN | Dopamine D2 receptor
Type:
Enzyme Catalytic Domain
Mol. Mass.:
50698.79
Organism:
BOVINE
Description:
P20288
Residue:
444
  
Inhibitor
Name:
BDBM50060601
Synonyms:
(E)-6-(3-oxo-3-phenylprop-1-enyl)pyrimidine-2,4(1H,3H)-dione 6-((E)-3-Oxo-3-phenyl-propenyl)-1H-pyrimidine-2,4-dione L-pro-L-leu-gly-NH2 Pyrrolidine-2-carboxylic acid [1-(carbamoylmethyl-carbamoyl)-3-methyl-butyl]-amide
Type:
Small organic molecule
Emp. Form.:
C13H24N4O3
Mol. Mass.:
284.3547
SMILES:
CC(C)C[C@H](NC(=O)[C@@H]1CCCN1)C(=O)NCC(N)=O
: