Target
Glutamate receptor ionotropic, kainate 5
Ligand
BDBM50060627
Substrate
Meas. Tech.
ChEMBL_90444 (CHEMBL698076)
Ki
0.24±n/a nM
Citation
 Jane, DEHoo, KKamboj, RDeverill, MBleakman, DMandelzys, A Synthesis of willardiine and 6-azawillardiine analogs: pharmacological characterization on cloned homomeric human AMPA and kainate receptor subtypes. J Med Chem 40:3645-50 (1997)  
Target
Name:
Glutamate receptor ionotropic, kainate 5
Synonyms:
GRIK2 GRIK5_HUMAN Glutamate receptor, ionotropic kainate 5 Ionotropic glutamate receptor kainate 2/5
Type:
Enzyme Catalytic Domain
Mol. Mass.:
109280.81
Organism:
Homo sapiens (Human)
Description:
Glutamate-Kainate 5 Grik5 HUMAN::Q16478
Residue:
980
  
Inhibitor
Name:
BDBM50060627
Synonyms:
(S)-2-Amino-3-(5-iodo-2,4-dioxo-3,4-dihydro-2H-pyrimidin-1-yl)-propionic acid 2-AMINO-3-(5-IODO-2,4-DIOXO-3,4-DIHYDRO-2H-PYRIMIDIN-1-YL)-PROPIONIC ACID | CHEMBL121915
Type:
Small organic molecule
Emp. Form.:
C7H8IN3O4
Mol. Mass.:
325.0606
SMILES:
N[C@@H](Cn1cc(I)c(=O)[nH]c1=O)C(O)=O
: